Reaction Details
TargetActivated CDC42 kinase 1
LigandBDBM50421257
Substrate/Competitorn/a
Meas. Tech.ChEMBL_840100 (CHEMBL2090704)
IC50 10±n/a nM
Citation Jiao, XKopecky, DJLiu, JLiu, JJaen, JCCardozo, MGSharma, RWalker, NWesche, HLi, SFarrelly, EXiao, SHWang, ZKayser, F Synthesis and optimization of substituted furo[2,3-d]-pyrimidin-4-amines and 7H-pyrrolo[2,3-d]pyrimidin-4-amines as ACK1 inhibitors. Bioorg Med Chem Lett22:6212-7 (2012) 
 
Activated CDC42 kinase 1
Name:Activated CDC42 kinase 1
Type:PROTEIN
Mol. Mass.:116986.19
Organism:Mus musculus
Description:ChEMBL_840100
Residue:1055
BDBM50421257
NameBDBM50421257
Synonyms:CHEMBL2087875
TypeSmall organic molecule
Emp. Form.C28H31N5OS2
Mol. Mass.517.709
SMILESC(CN1CCCC1)Oc1ccc(cc1)-c1[nH]c2ncnc(NCC3SCCS3)c2c1-c1ccccc1