Reaction Details
TargetTyrosine-protein kinase JAK3
LigandBDBM50421257
Substrate/Competitorn/a
Meas. Tech.ChEMBL_840107 (CHEMBL2090810)
Ki 6.5±n/a nM
Citation Jiao, XKopecky, DJLiu, JLiu, JJaen, JCCardozo, MGSharma, RWalker, NWesche, HLi, SFarrelly, EXiao, SHWang, ZKayser, F Synthesis and optimization of substituted furo[2,3-d]-pyrimidin-4-amines and 7H-pyrrolo[2,3-d]pyrimidin-4-amines as ACK1 inhibitors. Bioorg Med Chem Lett22:6212-7 (2012) 
 
Tyrosine-protein kinase JAK3
Name:Tyrosine-protein kinase JAK3
Type:Protein
Mol. Mass.:125111.08
Organism:Homo sapiens (Human)
Description:P52333
Residue:1124
BDBM50421257
NameBDBM50421257
Synonyms:CHEMBL2087875
TypeSmall organic molecule
Emp. Form.C28H31N5OS2
Mol. Mass.517.709
SMILESC(CN1CCCC1)Oc1ccc(cc1)-c1[nH]c2ncnc(NCC3SCCS3)c2c1-c1ccccc1