Reaction Details
TargetActivated CDC42 kinase 1
LigandBDBM50421279
Substrate/Competitorn/a
Meas. Tech.ChEMBL_840100 (CHEMBL2090704)
IC50 20±n/a nM
Citation Jiao, XKopecky, DJLiu, JLiu, JJaen, JCCardozo, MGSharma, RWalker, NWesche, HLi, SFarrelly, EXiao, SHWang, ZKayser, F Synthesis and optimization of substituted furo[2,3-d]-pyrimidin-4-amines and 7H-pyrrolo[2,3-d]pyrimidin-4-amines as ACK1 inhibitors. Bioorg Med Chem Lett22:6212-7 (2012) 
 
Activated CDC42 kinase 1
Name:Activated CDC42 kinase 1
Type:PROTEIN
Mol. Mass.:116986.19
Organism:Mus musculus
Description:ChEMBL_840100
Residue:1055
BDBM50421279
NameBDBM50421279
Synonyms:CHEMBL2087655
TypeSmall organic molecule
Emp. Form.C27H31N5O2
Mol. Mass.457.5673
SMILESCN(C)CCOc1ccc(cc1)-c1[nH]c2ncnc(NC[C@@H]3CCCO3)c2c1-c1ccccc1