Reaction Details
TargetIntegrin alpha-4/beta-1
LigandBDBM50115179
Substrate/Competitorn/a
Meas. Tech.ChEMBL_213396 (CHEMBL818054)
IC50 11400±n/a nM
Citation Singh, JVan Vlijmen, HLiao, YLee, WCCornebise, MHarris, MShu, IHGill, ACuervo, JHAbraham, WMAdams, SP Identification of potent and novel alpha4beta1 antagonists using in silico screening. J Med Chem45:2988-93 (2002) Integrin alpha-4/beta-1
Name:Integrin alpha-4/beta-1
Type:n/a
Mol. Mass.:n/a
Description:ASSAY_ID of EBI is 88912
Components:This complex has 2 components.
Component 1
Name:Integrin beta-1
Synonyms:CD_antigen=CD29 Fibronectin receptor beta GPIIA ITGB1 MDF2 | MSK12
Type:Enzyme
Mol. Mass.:88400.38
Organism:Homo sapiens (Human)
Description:P05556
Residue:798
Component 2
Name:Integrin alpha-4
Synonyms:CD49 antigen-like family member D CD49d antigen ITA4_HUMAN Integrin alpha-4 Integrin alpha-IV VLA-4 integrin alpha 4 precursor | integrin alpha-4 precursor
Type:Membrane Protein
Mol. Mass.:114897.35
Organism:Homo sapiens (Human)
Description:P13612
Residue:1032
BDBM50115179
NameBDBM50115179
Synonyms:3-(3-{2-[4-(3-o-Tolyl-ureido)-phenyl]-acetylamino}-phenyl)-propionic acid | CHEMBL103301
TypeSmall organic molecule
Emp. Form.C25H25N3O4
Mol. Mass.431.4837
SMILESCc1ccccc1NC(=O)Nc1ccc(CC(=O)Nc2cccc(CCC(O)=O)c2)cc1