Reaction Details
TargetBeta-2 adrenergic receptor
LigandBDBM50422410
Substrate/Competitorn/a
Meas. Tech.ChEMBL_38470 (CHEMBL652427)
IC50 5012±n/a nM
Citation Uehling, DEDonaldson, KHDeaton, DNHyman, CESugg, EEBarrett, DGHughes, RGReitter, BAdkison, KKLancaster, MELee, FHart, RPaulik, MASherman, BWTrue, TCowan, C Synthesis and evaluation of potent and selective beta(3) adrenergic receptor agonists containing acylsulfonamide, sulfonylsulfonamide, and sulfonylurea carboxylic acid isosteres. J Med Chem45:567-83 (2002) Beta-2 adrenergic receptor
Name:Beta-2 adrenergic receptor
Type:n/a
Mol. Mass.:46461.69
Organism:Homo sapiens (Human)
Description:P07550
Residue:413
BDBM50422410
NameBDBM50422410
Synonyms:CHEMBL348501
TypeSmall organic molecule
Emp. Form.C26H30ClN3O4S
Mol. Mass.516.052
SMILESC[C@H](CNc1ccc(CC(=O)NS(=O)(=O)c2ccc(C)cc2)cc1)NC[C@H](O)c1cccc(Cl)c1