Reaction Details
TargetBeta-1 adrenergic receptor
LigandBDBM50422411
Substrate/Competitorn/a
Meas. Tech.ChEMBL_37517 (CHEMBL647214)
IC50 1000±n/a nM
Citation Uehling, DEDonaldson, KHDeaton, DNHyman, CESugg, EEBarrett, DGHughes, RGReitter, BAdkison, KKLancaster, MELee, FHart, RPaulik, MASherman, BWTrue, TCowan, C Synthesis and evaluation of potent and selective beta(3) adrenergic receptor agonists containing acylsulfonamide, sulfonylsulfonamide, and sulfonylurea carboxylic acid isosteres. J Med Chem45:567-83 (2002) Beta-1 adrenergic receptor
Name:Beta-1 adrenergic receptor
Type:G Protein-Coupled Receptor (GPCR)
Mol. Mass.:51338.40
Organism:Homo sapiens (Human)
Description:P08588
Residue:477
BDBM50422411
NameBDBM50422411
Synonyms:CHEMBL154419
TypeSmall organic molecule
Emp. Form.C19H23ClN2O3
Mol. Mass.362.851
SMILESC[C@H](CNc1ccc(CC(O)=O)cc1)NC[C@H](O)c1cccc(Cl)c1