Reaction Details
TargetThromboxane A2 receptor
LigandBDBM50423023
Substrate/Competitorn/a
Meas. Tech.ChEMBL_440950 (CHEMBL890041)
IC50 2.5±n/a nM
Citation Hall, ABrown, SHChessell, IPChowdhury, AClayton, NMColeman, TGiblin, GMHammond, BHealy, MPJohnson, MRMetcalf, AMichel, ADNaylor, ANovelli, RSpalding, DJSweeting, J 1,5-Biaryl pyrrole derivatives as EP1 receptor antagonists: Structure-activity relationships of 4- and 5-substituted benzoic acid derivatives. Bioorg Med Chem Lett17:732-5 (2007) 
 
Thromboxane A2 receptor
Name:Thromboxane A2 receptor
Type:Enyzme
Mol. Mass.:37445.28
Organism:Homo sapiens (Human)
Description:P21731
Residue:343
BDBM50423023
NameBDBM50423023
Synonyms:CHEMBL427844
TypeSmall organic molecule
Emp. Form.C27H21BrF2N2O4
Mol. Mass.555.367
SMILESCC(=O)Nc1cc(cc(c1)-n1c(C)ccc1-c1cc(Br)ccc1OCc1ccc(F)cc1F)C(O)=O