Reaction Details
TargetGlucocorticoid receptor
LigandBDBM50423193
Substrate/Competitorn/a
Meas. Tech.ChEMBL_448638 (CHEMBL897790)
IC50 6.8±n/a nM
Citation Clackers, MCoe, DMDemaine, DAHardy, GWHumphreys, DInglis, GGJohnston, MJJones, HTHouse, DLoiseau, RMinick, DJSkone, PAUings, IMcLay, IMMacdonald, SJ Non-steroidal glucocorticoid agonists: the discovery of aryl pyrazoles as A-ring mimetics. Bioorg Med Chem Lett17:4737-45 (2007) 
 
Glucocorticoid receptor
Name:Glucocorticoid receptor
Type:Enzyme
Mol. Mass.:85656.87
Organism:Homo sapiens (Human)
Description:P04150
Residue:777
BDBM50423193
NameBDBM50423193
Synonyms:CHEMBL235208
TypeSmall organic molecule
Emp. Form.C24H25F5N4O3
Mol. Mass.512.4723
SMILESCOc1ccc(F)cc1C(C)(C)CC(O)(CNC(=O)c1cnn(c1N)-c1ccc(F)cc1)C(F)(F)F