Reaction Details
TargetAlbumin
LigandBDBM50343352
Substrate/Competitorn/a
Meas. Tech.ChEMBL_475196 (CHEMBL925737)
Kd 4677±n/a nM
Citation Lázaro, ELowe, PJBriand, XFaller, B New approach to measure protein binding based on a parallel artificial membrane assay and human serum albumin. J Med Chem51:2009-17 (2008) 
 
Albumin
Name:Albumin
Type:PROTEIN
Mol. Mass.:69362.94
Organism:Homo sapiens (Human)
Description:ChEMBL_1509401
Residue:609
BDBM50343352
NameBDBM50343352
Synonyms:2-hydroxy-3-(3-oxo-1-phenylbutyl)-4H-chromen-4-one 4-Hydroxy-3-(3-oxo-1-phenyl-butyl)-chromen-2-one CHEMBL1464 Jantoven wafarin warfarine
TypeSmall organic molecule
Emp. Form.C19H16O4
Mol. Mass.308.3279
SMILESCC(=O)CC(c1ccccc1)c1c(O)c2ccccc2oc1=O