Reaction Details
TargetCysteine synthase
LigandBDBM50423701
Substrate/Competitorn/a
Meas. Tech.ChEMBL_596272 (CHEMBL1050688)
Kd 2290868±n/a nM
Citation Salsi, EBayden, ASSpyrakis, FAmadasi, ACampanini, BBettati, SDodatko, TCozzini, PKellogg, GECook, PFRoderick, SLMozzarelli, A Design of O-acetylserine sulfhydrylase inhibitors by mimicking nature. J Med Chem53:345-56 (2010) 
 
Cysteine synthase
Name:Cysteine synthase
Type:PROTEIN
Mol. Mass.:33385.00
Organism:Haemophilus influenzae (strain ATCC 51907 / DSM 11121 / KW20 / Rd)
Description:ChEMBL_596272
Residue:316
BDBM50423701
NameBDBM50423701
Synonyms:CHEMBL576268
TypeSmall organic molecule
Emp. Form.C22H38N6O9S
Mol. Mass.562.637
SMILESCC[C@H](C)[C@H](NC(=O)CNC(=O)[C@H](CCC(O)=O)NC(=O)[C@H](CC(N)=O)NC(=O)[C@@H](N)CCSC)C(O)=O