Reaction Details
TargetDynamin-2
LigandBDBM50268295
Substrate/Competitorn/a
Meas. Tech.ChEMBL_934670 (CHEMBL2318140)
IC50 5000±n/a nM
Citation Gordon, CPVenn-Brown, BRobertson, MJYoung, KAChau, NMariana, AWhiting, AChircop, MRobinson, PJMcCluskey, A Development of second-generation indole-based dynamin GTPase inhibitors. J Med Chem56:46-59 (2013) 
 
Dynamin-2
Name:Dynamin-2
Type:PROTEIN
Mol. Mass.:98071.19
Organism:Homo sapiens (Human)
Description:ChEMBL_934670
Residue:870
BDBM50268295
NameBDBM50268295
Synonyms:2-Cyano-N-octyl-3-(1-(3-dimethylaminopropyl)-1H-indol-3-yl)-acrylamide | CHEMBL483059
TypeSmall organic molecule
Emp. Form.C25H36N4O
Mol. Mass.408.5795
SMILESCCCCCCCCNC(=O)C(=C\c1cn(CCCN(C)C)c2ccccc12)\C#N