Reaction Details
TargetCholinesterase
LigandBDBM50424044
Substrate/Competitorn/a
Meas. Tech.ChEMBL_936731 (CHEMBL2319647)
IC50 4000±n/a nM
Citation Catto, MPisani, LLeonetti, FNicolotti, OPesce, PStefanachi, ACellamare, SCarotti, A Design, synthesis and biological evaluation of coumarin alkylamines as potent and selective dual binding site inhibitors of acetylcholinesterase. Bioorg Med Chem21:146-52 (2012) 
 
Cholinesterase
Name:Cholinesterase
Type:Enzyme
Mol. Mass.:65643.35
Organism:Equus caballus (Horse)
Description:P81908
Residue:574
BDBM50424044
NameBDBM50424044
Synonyms:CHEMBL2314727
TypeSmall organic molecule
Emp. Form.C20H21NO3
Mol. Mass.323.3856
SMILESCN(CCCOc1cc2ccccc2oc1=O)Cc1ccccc1