Reaction Details
TargetCholinesterase
LigandBDBM50424046
Substrate/Competitorn/a
Meas. Tech.ChEMBL_936731 (CHEMBL2319647)
IC50 4700±n/a nM
Citation Catto, MPisani, LLeonetti, FNicolotti, OPesce, PStefanachi, ACellamare, SCarotti, A Design, synthesis and biological evaluation of coumarin alkylamines as potent and selective dual binding site inhibitors of acetylcholinesterase. Bioorg Med Chem21:146-52 (2012) 
 
Cholinesterase
Name:Cholinesterase
Type:Enzyme
Mol. Mass.:65643.35
Organism:Equus caballus (Horse)
Description:P81908
Residue:574
BDBM50424046
NameBDBM50424046
Synonyms:CHEMBL2314721
TypeSmall organic molecule
Emp. Form.C25H27NO6
Mol. Mass.437.485
SMILESCOc1cc2cc(C(=O)OCC3CCN(Cc4ccccc4)CC3)c(=O)oc2cc1OC