Reaction Details
TargetHistone deacetylase 1
LigandBDBM24624
Substrate/Competitorn/a
Meas. Tech.ChEMBL_933603 (CHEMBL2319987)
IC50 184±n/a nM
Citation Li, YZhou, YQian, PWang, YJiang, FYao, ZHu, WZhao, YLi, S Design, synthesis and bioevalution of novel benzamides derivatives as HDAC inhibitors. Bioorg Med Chem Lett23:179-82 (2012) 
 
Histone deacetylase 1
Name:Histone deacetylase 1
Type:Enzyme
Mol. Mass.:55090.27
Organism:Homo sapiens (Human)
Description:Q13547
Residue:482
BDBM24624
NameBDBM24624
Synonyms:CHEMBL272980 MGCD0103 US10227295, Compound MGCD0103 US9409858, MGCD0103 US9956192, Compound MGCD0103
TypeSmall organic molecule
Emp. Form.C23H20N6O
Mol. Mass.396.4445
SMILESNc1ccccc1NC(=O)c1ccc(CNc2nccc(n2)-c2cccnc2)cc1