Reaction Details
TargetCyclin-dependent kinase 5 activator 1
LigandBDBM50424266
Substrate/Competitorn/a
Meas. Tech.ChEMBL_935030 (CHEMBL2320636)
IC50 17±n/a nM
Citation Demange, LAbdellah, FNLozach, OFerandin, YGresh, NMeijer, LGalons, H Potent inhibitors of CDK5 derived from roscovitine: synthesis, biological evaluation and molecular modelling. Bioorg Med Chem Lett23:125-31 (2012) 
 
Cyclin-dependent kinase 5 activator 1
Name:Cyclin-dependent kinase 5 activator 1
Type:Protein Complex
Mol. Mass.:n/a
Description:n/a
Components:This complex has 2 components.
Component 1
Name:Cyclin-dependent kinase 5
Synonyms:CDK5 CDKN5 Cyclin-dependent kinase 5 (CDK5/ p25) Cyclin-dependent-like kinase 5 PSSALRE Tau protein kinase II catalytic subunit
Type:Enzyme Subunit
Mol. Mass.:33308.61
Organism:Homo sapiens (Human)
Description:n/a
Residue:292
Component 2
Name:Cyclin-dependent kinase 5 activator 1
Synonyms:CD5R1_HUMAN CDK5R1 Cyclin-dependent kinase 5 (CDK5/p25) NCK5A p35
Type:Enzyme Subunit
Mol. Mass.:34077.43
Organism:Homo sapiens (Human)
Description:Q15078
Residue:307
BDBM50424266
NameBDBM50424266
Synonyms:CHEMBL2314466
TypeSmall organic molecule
Emp. Form.C17H23N7O
Mol. Mass.341.4108
SMILESCC[C@H](CO)Nc1nc(Nc2ccncc2)c2ncn(C(C)C)c2n1