Reaction Details
TargetHistamine H4 receptor
LigandBDBM50424340
Substrate/Competitorn/a
Meas. Tech.ChEMBL_935304 (CHEMBL2318421)
Ki 1410±n/a nM
Citation Gao, LJSchwed, JSWeizel, LDe Jonghe, SStark, HHerdewijn, P Synthesis and evaluation of novel ligands for the histamine H4 receptor based on a pyrrolo[2,3-d]pyrimidine scaffold. Bioorg Med Chem Lett23:132-7 (2012) 
 
Histamine H4 receptor
Name:Histamine H4 receptor
Type:G Protein-Coupled Receptor (GPCR)
Mol. Mass.:44517.02
Organism:Homo sapiens (Human)
Description:Binding assays were using CHO cells stably expressing hH4R receptors.
Residue:390
BDBM50424340
NameBDBM50424340
Synonyms:CHEMBL2314772
TypeSmall organic molecule
Emp. Form.C16H18N6
Mol. Mass.294.3543
SMILESNc1nc(N2CCNCC2)c2cc([nH]c2n1)-c1ccccc1