Reaction Details
TargetGlucose-dependent insulinotropic receptor
LigandBDBM50424576
Substrate/Competitorn/a
Meas. Tech.ChEMBL_933672 (CHEMBL2320533)
Ki 15±n/a nM
Citation Darout, ERobinson, RPMcClure, KFCorbett, MLi, BShavnya, AAndrews, MPJones, CSLi, QMinich, MLMascitti, VGuimarães, CRMunchhof, MJBahnck, KBCai, CPrice, DALiras, SBonin, PDCornelius, PWang, RBagdasarian, VSobota, CPHornby, SMasterson, VMJoseph, RMKalgutkar, ASChen, Y Design and synthesis of diazatricyclodecane agonists of the G-protein-coupled receptor 119. J Med Chem56:301-19 (2013) 
 
Glucose-dependent insulinotropic receptor
Name:Glucose-dependent insulinotropic receptor
Type:Protein
Mol. Mass.:36901.49
Organism:Homo sapiens (Human)
Description:Q8TDV5
Residue:335
BDBM50424576
NameBDBM50424576
Synonyms:CHEMBL2312158
TypeSmall organic molecule
Emp. Form.C25H27FN8O3
Mol. Mass.506.5321
SMILESCc1c(Oc2ccc(cc2F)-n2cnnn2)ncnc1N1C2CC3CC1CC(C2)N3C(=O)OC1(C)CC1