Reaction Details
TargetSolute carrier family 22 member 2
LigandBDBM50424713
Substrate/Competitorn/a
Meas. Tech.ChEMBL_934317 (CHEMBL2320303)
IC50 3500±n/a nM
Citation Wittwer, MBZur, AAKhuri, NKido, YKosaka, AZhang, XMorrissey, KMSali, AHuang, YGiacomini, KM Discovery of potent, selective multidrug and toxin extrusion transporter 1 (MATE1, SLC47A1) inhibitors through prescription drug profiling and computational modeling. J Med Chem56:781-95 (2013) 
 
Solute carrier family 22 member 2
Name:Solute carrier family 22 member 2
Type:PROTEIN
Mol. Mass.:62591.01
Organism:Homo sapiens (Human)
Description:ChEMBL_1484077
Residue:555
BDBM50424713
NameBDBM50424713
Synonyms:Musculax ORG NC 45 VECURONIUM BROMIDE
TypeSmall organic molecule
Emp. Form.C34H57N2O4
Mol. Mass.557.8268
SMILESCC(=O)O[C@H]1[C@H](C[C@H]2[C@@H]3CC[C@H]4C[C@H](OC(C)=O)[C@H](C[C@]4(C)[C@H]3CC[C@]12C)N1CCCCC1)[N+]1(C)CCCCC1