Reaction Details
TargetMultidrug and toxin extrusion protein 2
LigandBDBM50009073
Substrate/Competitorn/a
Meas. Tech.ChEMBL_934318 (CHEMBL2320304)
IC50 7600±n/a nM
Citation Wittwer, MBZur, AAKhuri, NKido, YKosaka, AZhang, XMorrissey, KMSali, AHuang, YGiacomini, KM Discovery of potent, selective multidrug and toxin extrusion transporter 1 (MATE1, SLC47A1) inhibitors through prescription drug profiling and computational modeling. J Med Chem56:781-95 (2013) 
 
Multidrug and toxin extrusion protein 2
Name:Multidrug and toxin extrusion protein 2
Type:PROTEIN
Mol. Mass.:65098.38
Organism:Homo sapiens (Human)
Description:ChEMBL_934314
Residue:602
BDBM50009073
NameBDBM50009073
Synonyms:4-(5-cyclopentyloxycarbonylamino-1-methyl-1H-indol-3-ylmethyl)-3-methoxy-N-o-tolylsulfonylbenzamide ZAFIRLUKAST cyclopentyl 3-[2-methoxy-4-(2-methylphenylsulfonylcarbamoyl)benzyl]-1-methyl-1H-indol-5-ylcarbamate
TypeSmall organic molecule
Emp. Form.C31H33N3O6S
Mol. Mass.575.675
SMILESCOc1cc(ccc1Cc1cn(C)c2ccc(NC(=O)OC3CCCC3)cc12)C(=O)NS(=O)(=O)c1ccccc1C