Reaction Details
TargetMultidrug and toxin extrusion protein 2
LigandBDBM50000483
Substrate/Competitorn/a
Meas. Tech.ChEMBL_934318 (CHEMBL2320304)
IC50 311000±n/a nM
Citation Wittwer, MBZur, AAKhuri, NKido, YKosaka, AZhang, XMorrissey, KMSali, AHuang, YGiacomini, KM Discovery of potent, selective multidrug and toxin extrusion transporter 1 (MATE1, SLC47A1) inhibitors through prescription drug profiling and computational modeling. J Med Chem56:781-95 (2013) 
 
Multidrug and toxin extrusion protein 2
Name:Multidrug and toxin extrusion protein 2
Type:PROTEIN
Mol. Mass.:65098.38
Organism:Homo sapiens (Human)
Description:ChEMBL_934314
Residue:602
BDBM50000483
NameBDBM50000483
Synonyms:(BRL 43694)1-Methyl-1H-indazole-3-carboxylic acid (9-methyl-9-aza-bicyclo[3.3.1]non-3-yl)-amide 1-Methyl-1H-indazole-3-carboxylic acid (8-methyl-8-aza-bicyclo[3.2.1]oct-3-yl)-amide 1-Methyl-1H-indazole-3-carboxylic acid (9-methyl-9-aza-bicyclo[3.3.1]non-3-yl)-amide(BRL 43694) 1-methyl-N-((1S,5R)-9-methyl-9-aza-bicyclo[3.3.1]nonan-3-yl)-1H-indazole-3-carboxamide BRL 43694 CHEMBL519643 LY-278584
TypeSmall organic molecule
Emp. Form.C18H24N4O
Mol. Mass.312.4094
SMILESCN1C2CCCC1CC(C2)NC(=O)c1nn(C)c2ccccc12