Reaction Details
TargetMultidrug and toxin extrusion protein 1
LigandBDBM50403559
Substrate/Competitorn/a
Meas. Tech.ChEMBL_934320 (CHEMBL2320306)
IC50 1200±n/a nM
Citation Wittwer, MBZur, AAKhuri, NKido, YKosaka, AZhang, XMorrissey, KMSali, AHuang, YGiacomini, KM Discovery of potent, selective multidrug and toxin extrusion transporter 1 (MATE1, SLC47A1) inhibitors through prescription drug profiling and computational modeling. J Med Chem56:781-95 (2013) 
 
Multidrug and toxin extrusion protein 1
Name:Multidrug and toxin extrusion protein 1
Type:PROTEIN
Mol. Mass.:61928.01
Organism:Homo sapiens (Human)
Description:ChEMBL_934313
Residue:570
BDBM50403559
NameBDBM50403559
Synonyms:Brumetadina | CIMETIDINE
TypeSmall organic molecule
Emp. Form.C10H16N6S
Mol. Mass.252.339
SMILESCNC(NCCSCc1[nH]cnc1C)=NC#N