Reaction Details
TargetMultidrug and toxin extrusion protein 1
LigandBDBM50017129
Substrate/Competitorn/a
Meas. Tech.ChEMBL_934320 (CHEMBL2320306)
IC50>500000±n/a nM
Citation Wittwer, MBZur, AAKhuri, NKido, YKosaka, AZhang, XMorrissey, KMSali, AHuang, YGiacomini, KM Discovery of potent, selective multidrug and toxin extrusion transporter 1 (MATE1, SLC47A1) inhibitors through prescription drug profiling and computational modeling. J Med Chem56:781-95 (2013) 
 
Multidrug and toxin extrusion protein 1
Name:Multidrug and toxin extrusion protein 1
Type:PROTEIN
Mol. Mass.:61928.01
Organism:Homo sapiens (Human)
Description:ChEMBL_934313
Residue:570
BDBM50017129
NameBDBM50017129
Synonyms:(S)-1-((S)-2-((R)-1-ethoxy-1-oxo-4-phenylbutan-2-ylamino)propanoyl)pyrrolidine-2-carboxylic acid (S)-1-{(S)-2-[1-((S)-Ethoxycarbonyl)-3-phenyl-propylamino]-propionyl}-pyrrolidine-2-carboxylic acid (SSS)1-[2-(1-Ethoxycarbonyl-3-phenyl-propylamino)-propionyl]-pyrrolidine-2-carboxylic acid 1-[2-(1-Ethoxycarbonyl-3-phenyl-propylamino)-propionyl]-pyrrolidine-2-carboxylic acid (Enalapril) 2-[2-(1-Carboxy-3-phenyl-propylamino)-propionyl]-1,2,3,4-tetrahydro-isoquinoline-3-carboxylic acid(enalapril) ENALAPRIL Lexxel Vaseretic | Vasotec
TypeSmall organic molecule
Emp. Form.C20H28N2O5
Mol. Mass.376.4467
SMILESCCOC(=O)[C@H](CCc1ccccc1)N[C@@H](C)C(=O)N1CCC[C@H]1C(O)=O