Reaction Details
TargetMultidrug and toxin extrusion protein 1
LigandBDBM22893
Substrate/Competitorn/a
Meas. Tech.ChEMBL_934320 (CHEMBL2320306)
IC50 8300±n/a nM
Citation Wittwer, MBZur, AAKhuri, NKido, YKosaka, AZhang, XMorrissey, KMSali, AHuang, YGiacomini, KM Discovery of potent, selective multidrug and toxin extrusion transporter 1 (MATE1, SLC47A1) inhibitors through prescription drug profiling and computational modeling. J Med Chem56:781-95 (2013) 
 
Multidrug and toxin extrusion protein 1
Name:Multidrug and toxin extrusion protein 1
Type:PROTEIN
Mol. Mass.:61928.01
Organism:Homo sapiens (Human)
Description:ChEMBL_934313
Residue:570
BDBM22893
NameBDBM22893
Synonyms:CHEMBL512 ZANTAC | dimethyl[(5-{[(2-{[(E)-1-(methylamino)-2-nitroethenyl]amino}ethyl)sulfanyl]methyl}furan-2-yl)methyl]amine
TypeSmall organic molecule
Emp. Form.C13H22N4O3S
Mol. Mass.314.404
SMILESCN\C([CH-][N+]([O-])=O)=[NH+]/CCSCc1ccc(CN(C)C)o1