Reaction Details
TargetSolute carrier family 22 member 1
LigandBDBM50170723
Substrate/Competitorn/a
Meas. Tech.ChEMBL_934316 (CHEMBL2320302)
IC50 210±n/a nM
Citation Wittwer, MBZur, AAKhuri, NKido, YKosaka, AZhang, XMorrissey, KMSali, AHuang, YGiacomini, KM Discovery of potent, selective multidrug and toxin extrusion transporter 1 (MATE1, SLC47A1) inhibitors through prescription drug profiling and computational modeling. J Med Chem56:781-95 (2013) 
 
Solute carrier family 22 member 1
Name:Solute carrier family 22 member 1
Type:Enzyme Catalytic Domain
Mol. Mass.:61154.85
Organism:Homo sapiens (Human)
Description:Adrenergic Alpha 0 HUMAN::O15245
Residue:554
BDBM50170723
NameBDBM50170723
Synonyms:1,1'-Hexamethylene bis(5-(p-chlorophenyl)biguanide) CHLORHEXIDINE N,N'-Bis(4-chlorophenyl)-3,12-diimino-2,4,11,13-tetraazatetradecanediimidamide
TypeSmall organic molecule
Emp. Form.C22H30Cl2N10
Mol. Mass.505.447
SMILESNC(NC(N)=Nc1ccc(Cl)cc1)=NCCCCCCN=C(N)N=C(N)Nc1ccc(Cl)cc1