Reaction Details
TargetSolute carrier family 22 member 2
LigandBDBM50151866
Substrate/Competitorn/a
Meas. Tech.ChEMBL_934317 (CHEMBL2320303)
IC50 10300±n/a nM
Citation Wittwer, MBZur, AAKhuri, NKido, YKosaka, AZhang, XMorrissey, KMSali, AHuang, YGiacomini, KM Discovery of potent, selective multidrug and toxin extrusion transporter 1 (MATE1, SLC47A1) inhibitors through prescription drug profiling and computational modeling. J Med Chem56:781-95 (2013) 
 
Solute carrier family 22 member 2
Name:Solute carrier family 22 member 2
Type:PROTEIN
Mol. Mass.:62591.01
Organism:Homo sapiens (Human)
Description:ChEMBL_1484077
Residue:555
BDBM50151866
NameBDBM50151866
Synonyms:6-(2-{(2-Hydroxy-ethyl)-[3-(4-nitro-phenyl)-propyl]-amino}-ethylamino)-1,3-dimethyl-1H-pyrimidine-2,4-dione Nifekalant
TypeSmall organic molecule
Emp. Form.C19H27N5O5
Mol. Mass.405.4482
SMILESCn1c(NCCN(CCO)CCCc2ccc(cc2)[N+]([O-])=O)cc(=O)n(C)c1=O