Reaction Details
TargetPro-cathepsin H
LigandBDBM50415097
Substrate/Competitorn/a
Meas. Tech.ChEMBL_936319 (CHEMBL2321251)
Ki 251000±n/a nM
Citation Sosic, IMirkovic, BArenz, KStefane, BKos, JGobec, S Development of new cathepsin B inhibitors: combining bioisosteric replacements and structure-based design to explore the structure-activity relationships of nitroxoline derivatives. J Med Chem56:521-33 (2013) 
 
Pro-cathepsin H
Name:Pro-cathepsin H
Type:PROTEIN
Mol. Mass.:37402.31
Organism:Homo sapiens (Human)
Description:ChEMBL_1459870
Residue:335
BDBM50415097
NameBDBM50415097
Synonyms:CHEMBL570897
TypeSmall organic molecule
Emp. Form.C14H14N2O2
Mol. Mass.242.2732
SMILES[O-][N+](=O)c1ccc(N2CCCC2)c2ccccc12