Reaction Details
TargetLeukotriene A-4 hydrolase
LigandBDBM50425147
Substrate/Competitorn/a
Meas. Tech.ChEMBL_936852 (CHEMBL2320734)
IC50 280±n/a nM
Citation Eccles, WBlevitt, JMBooker, JNChrovian, CCCrawford, Sde Leon, ARDeng, XFourie, AMGrice, CAHerman, KKarlsson, LKearney, AMLee-Dutra, ALiang, JLuna, RPippel, DRao, NRiley, JPSantillán, ASavall, BTanis, VMXue, XYoung, AL Identification of benzofuran central cores for the inhibition of leukotriene A(4) hydrolase. Bioorg Med Chem Lett23:811-5 (2013) 
 
Leukotriene A-4 hydrolase
Name:Leukotriene A-4 hydrolase
Type:PROTEIN
Mol. Mass.:69048.58
Organism:Mus musculus
Description:ChEMBL_936852
Residue:611
BDBM50425147
NameBDBM50425147
Synonyms:CHEMBL2313567
TypeSmall organic molecule
Emp. Form.C21H19N3O4S
Mol. Mass.409.458
SMILESOC(=O)C1CCN(Cc2coc3cc(Oc4nc5ncccc5s4)ccc23)CC1