Reaction Details
TargetLeukotriene A-4 hydrolase
LigandBDBM50425151
Substrate/Competitorn/a
Meas. Tech.ChEMBL_936844 (CHEMBL2320478)
IC50 4.6±n/a nM
Citation Eccles, WBlevitt, JMBooker, JNChrovian, CCCrawford, Sde Leon, ARDeng, XFourie, AMGrice, CAHerman, KKarlsson, LKearney, AMLee-Dutra, ALiang, JLuna, RPippel, DRao, NRiley, JPSantillán, ASavall, BTanis, VMXue, XYoung, AL Identification of benzofuran central cores for the inhibition of leukotriene A(4) hydrolase. Bioorg Med Chem Lett23:811-5 (2013) 
 
Leukotriene A-4 hydrolase
Name:Leukotriene A-4 hydrolase
Type:Hydrolase; metalloprotease
Mol. Mass.:69280.41
Organism:Homo sapiens (Human)
Description:Human recombinant LTA4H.
Residue:611
BDBM50425151
NameBDBM50425151
Synonyms:CHEMBL2313563
TypeSmall organic molecule
Emp. Form.C20H19N3O2S
Mol. Mass.365.449
SMILESC(N1CCCCC1)c1coc2cc(Oc3nc4ncccc4s3)ccc12