Reaction Details
TargetHistone-lysine N-methyltransferase EHMT2
LigandBDBM50425305
Substrate/Competitorn/a
Meas. Tech.ChEMBL_933812 (CHEMBL2321366)
IC50 5200±n/a nM
Citation Fujishiro, SDodo, KIwasa, ETeng, YSohtome, YHamashima, YIto, AYoshida, MSodeoka, M Epidithiodiketopiperazine as a pharmacophore for protein lysine methyltransferase G9a inhibitors: reducing cytotoxicity by structural simplification. Bioorg Med Chem Lett23:733-6 (2013) 
 
Histone-lysine N-methyltransferase EHMT2
Name:Histone-lysine N-methyltransferase EHMT2
Type:Enzyme
Mol. Mass.:132339.87
Organism:Homo sapiens (Human)
Description:Q96KQ7
Residue:1210
BDBM50425305
NameBDBM50425305
Synonyms:CHEMBL2315521
TypeSmall organic molecule
Emp. Form.C9H12N2O3S2
Mol. Mass.260.333
SMILESCN1C(=O)C23CCCN2C(=O)C1(CO)SS3