Reaction Details
TargetRap guanine nucleotide exchange factor 4
LigandBDBM50425541
Substrate/Competitorn/a
Meas. Tech.ChEMBL_936073 (CHEMBL2319315)
IC50 400±n/a nM
Citation Chen, HTsalkova, TChepurny, OGMei, FCHolz, GGCheng, XZhou, J Identification and characterization of small molecules as potent and specific EPAC2 antagonists. J Med Chem56:952-62 (2013) 
 
Rap guanine nucleotide exchange factor 4
Name:Rap guanine nucleotide exchange factor 4
Type:PROTEIN
Mol. Mass.:115526.83
Organism:Homo sapiens (Human)
Description:ChEMBL_1504794
Residue:1011
BDBM50425541
NameBDBM50425541
Synonyms:CHEMBL2313637
TypeSmall organic molecule
Emp. Form.C15H15Cl2N
Mol. Mass.280.192
SMILESCc1cc(C)c(Nc2cc(Cl)ccc2Cl)c(C)c1