Reaction Details
TargetTyrosine-protein kinase ABL1
LigandBDBM50425790
Substrate/Competitorn/a
Meas. Tech.ChEMBL_937547 (CHEMBL2320772)
IC50 1.9±n/a nM
Citation Ren, XPan, XZhang, ZWang, DLu, XLi, YWen, DLong, HLuo, JFeng, YZhuang, XZhang, FLiu, JLeng, FLang, XBai, YShe, MTu, ZPan, JDing, K Identification of GZD824 as an orally bioavailable inhibitor that targets phosphorylated and nonphosphorylated breakpoint cluster region-Abelson (Bcr-Abl) kinase and overcomes clinically acquired mutation-induced resistance against imatinib. J Med Chem56:879-94 (2013) 
 
Tyrosine-protein kinase ABL1
Name:Tyrosine-protein kinase ABL1
Type:Enzyme
Mol. Mass.:122897.30
Organism:Homo sapiens (Human)
Description:P00519
Residue:1130
BDBM50425790
NameBDBM50425790
Synonyms:CHEMBL2316584
TypeSmall organic molecule
Emp. Form.C30H29F3N6O
Mol. Mass.546.5861
SMILESCCc1ccc(cc1C#Cc1cnc2[nH]ncc2c1)C(=O)Nc1ccc(CN2CCN(C)CC2)c(c1)C(F)(F)F