Reaction Details
TargetCytochrome P450 2C9
LigandBDBM50425780
Substrate/Competitorn/a
Meas. Tech.ChEMBL_937208 (CHEMBL2318534)
IC50 110±n/a nM
Citation Ren, XPan, XZhang, ZWang, DLu, XLi, YWen, DLong, HLuo, JFeng, YZhuang, XZhang, FLiu, JLeng, FLang, XBai, YShe, MTu, ZPan, JDing, K Identification of GZD824 as an orally bioavailable inhibitor that targets phosphorylated and nonphosphorylated breakpoint cluster region-Abelson (Bcr-Abl) kinase and overcomes clinically acquired mutation-induced resistance against imatinib. J Med Chem56:879-94 (2013) 
 
Cytochrome P450 2C9
Name:Cytochrome P450 2C9
Type:Enzyme
Mol. Mass.:55636.33
Organism:Homo sapiens (Human)
Description:P11712
Residue:490
BDBM50425780
NameBDBM50425780
Synonyms:CHEMBL2316582
TypeSmall organic molecule
Emp. Form.C29H27F3N6O
Mol. Mass.532.5595
SMILESCN1CCN(Cc2ccc(NC(=O)c3ccc(C)c(c3)C#Cc3cnc4[nH]ncc4c3)cc2C(F)(F)F)CC1