Reaction Details
TargetLow molecular weight phosphotyrosine protein phosphatase
LigandBDBM50425806
Substrate/Competitorn/a
Meas. Tech.ChEMBL_937593 (CHEMBL2321062)
IC50 3000±n/a nM
Citation He, YXu, JYu, ZHGunawan, AMWu, LWang, LZhang, ZY Discovery and evaluation of novel inhibitors of mycobacterium protein tyrosine phosphatase B from the 6-Hydroxy-benzofuran-5-carboxylic acid scaffold. J Med Chem56:832-42 (2013) 
 
Low molecular weight phosphotyrosine protein phosphatase
Name:Low molecular weight phosphotyrosine protein phosphatase
Type:n/a
Mol. Mass.:18042.81
Organism:Homo sapiens (Human)
Description:P24666
Residue:158
BDBM50425806
NameBDBM50425806
Synonyms:CHEMBL2316907
TypeSmall organic molecule
Emp. Form.C24H13F3O5
Mol. Mass.438.3522
SMILESOC(=O)c1cc2c(C#Cc3ccc(OC(F)(F)F)cc3)c(oc2cc1O)-c1ccccc1