Reaction Details
TargetSerine/threonine-protein kinase Chk1
LigandBDBM50425832
Substrate/Competitorn/a
Meas. Tech.ChEMBL_933480 (CHEMBL2319136)
IC50>30000±n/a nM
Citation Powell, NAHoffman, JKCiske, FLKaufman, MDKohrt, JTQuin, JSheehan, DJDelaney, ABaxi, SMCatana, CMcConnell, POhren, JPerrin, LAEdmunds, JJ Highly selective 2,4-diaminopyrimidine-5-carboxamide inhibitors of Sky kinase. Bioorg Med Chem Lett23:1046-50 (2013) 
 
Serine/threonine-protein kinase Chk1
Name:Serine/threonine-protein kinase Chk1
Type:Enzyme Catalytic Domain
Mol. Mass.:54443.02
Organism:Homo sapiens (Human)
Description:gi_166295192
Residue:476
BDBM50425832
NameBDBM50425832
Synonyms:CHEMBL2312290
TypeSmall organic molecule
Emp. Form.C27H38N6O4
Mol. Mass.510.6284
SMILESCOc1ccc(CCNc2ncc(C(=O)NCCCN3CCCC3=O)c(NC3CCCC3)n2)cc1OC