Reaction Details
TargetTyrosine-protein kinase Mer
LigandBDBM50425829
Substrate/Competitorn/a
Meas. Tech.ChEMBL_937896 (CHEMBL2317036)
IC50 775±n/a nM
Citation Powell, NAHoffman, JKCiske, FLKaufman, MDKohrt, JTQuin, JSheehan, DJDelaney, ABaxi, SMCatana, CMcConnell, POhren, JPerrin, LAEdmunds, JJ Highly selective 2,4-diaminopyrimidine-5-carboxamide inhibitors of Sky kinase. Bioorg Med Chem Lett23:1046-50 (2013) 
 
Tyrosine-protein kinase Mer
Name:Tyrosine-protein kinase Mer
Type:PROTEIN
Mol. Mass.:110234.77
Organism:Homo sapiens (Human)
Description:ChEMBL_1498723
Residue:999
BDBM50425829
NameBDBM50425829
Synonyms:CHEMBL2312304
TypeSmall organic molecule
Emp. Form.C23H28Cl2N6O3
Mol. Mass.507.413
SMILESClc1ccc(Cl)c(CNc2ncc(C(=O)NCCCN3CCOC3=O)c(NC3CCCC3)n2)c1