Reaction Details
Target[Pyruvate dehydrogenase (acetyl-transferring)] kinase isozyme 1, mitochondrial
LigandBDBM50425829
Substrate/Competitorn/a
Meas. Tech.ChEMBL_933465 (CHEMBL2319121)
IC50>30000±n/a nM
Citation Powell, NAHoffman, JKCiske, FLKaufman, MDKohrt, JTQuin, JSheehan, DJDelaney, ABaxi, SMCatana, CMcConnell, POhren, JPerrin, LAEdmunds, JJ Highly selective 2,4-diaminopyrimidine-5-carboxamide inhibitors of Sky kinase. Bioorg Med Chem Lett23:1046-50 (2013) 
 
[Pyruvate dehydrogenase (acetyl-transferring)] kinase isozyme 1, mitochondrial
Name:[Pyruvate dehydrogenase (acetyl-transferring)] kinase isozyme 1, mitochondrial
Type:Protein
Mol. Mass.:49255.23
Organism:Homo sapiens (Human)
Description:Q15118
Residue:436
BDBM50425829
NameBDBM50425829
Synonyms:CHEMBL2312304
TypeSmall organic molecule
Emp. Form.C23H28Cl2N6O3
Mol. Mass.507.413
SMILESClc1ccc(Cl)c(CNc2ncc(C(=O)NCCCN3CCOC3=O)c(NC3CCCC3)n2)c1