Reaction Details
TargetGlycogen synthase kinase-3 beta
LigandBDBM50425831
Substrate/Competitorn/a
Meas. Tech.ChEMBL_933474 (CHEMBL2319130)
IC50>30000±n/a nM
Citation Powell, NAHoffman, JKCiske, FLKaufman, MDKohrt, JTQuin, JSheehan, DJDelaney, ABaxi, SMCatana, CMcConnell, POhren, JPerrin, LAEdmunds, JJ Highly selective 2,4-diaminopyrimidine-5-carboxamide inhibitors of Sky kinase. Bioorg Med Chem Lett23:1046-50 (2013) 
 
Glycogen synthase kinase-3 beta
Name:Glycogen synthase kinase-3 beta
Type:Enzyme
Mol. Mass.:46756.38
Organism:Homo sapiens (Human)
Description:P49841
Residue:420
BDBM50425831
NameBDBM50425831
Synonyms:CHEMBL2312301
TypeSmall organic molecule
Emp. Form.C25H34N6O3
Mol. Mass.466.5759
SMILESCOc1ccccc1CNc1ncc(C(=O)NCCCN2CCCC2=O)c(NC2CCCC2)n1