Reaction Details
TargetEpidermal growth factor receptor
LigandBDBM50425831
Substrate/Competitorn/a
Meas. Tech.ChEMBL_933476 (CHEMBL2319132)
IC50>30000±n/a nM
Citation Powell, NAHoffman, JKCiske, FLKaufman, MDKohrt, JTQuin, JSheehan, DJDelaney, ABaxi, SMCatana, CMcConnell, POhren, JPerrin, LAEdmunds, JJ Highly selective 2,4-diaminopyrimidine-5-carboxamide inhibitors of Sky kinase. Bioorg Med Chem Lett23:1046-50 (2013) 
 
Epidermal growth factor receptor
Name:Epidermal growth factor receptor
Type:Receptor Kinase Domain
Mol. Mass.:134279.59
Organism:Homo sapiens (Human)
Description:P00533
Residue:1210
BDBM50425831
NameBDBM50425831
Synonyms:CHEMBL2312301
TypeSmall organic molecule
Emp. Form.C25H34N6O3
Mol. Mass.466.5759
SMILESCOc1ccccc1CNc1ncc(C(=O)NCCCN2CCCC2=O)c(NC2CCCC2)n1