Reaction Details
TargetTyrosine-protein kinase receptor TYRO3
LigandBDBM50425842
Substrate/Competitorn/a
Meas. Tech.ChEMBL_933487 (CHEMBL2319403)
IC50 35±n/a nM
Citation Powell, NAHoffman, JKCiske, FLKaufman, MDKohrt, JTQuin, JSheehan, DJDelaney, ABaxi, SMCatana, CMcConnell, POhren, JPerrin, LAEdmunds, JJ Highly selective 2,4-diaminopyrimidine-5-carboxamide inhibitors of Sky kinase. Bioorg Med Chem Lett23:1046-50 (2013) 
 
Tyrosine-protein kinase receptor TYRO3
Name:Tyrosine-protein kinase receptor TYRO3
Type:Protein
Mol. Mass.:96894.13
Organism:Homo sapiens (Human)
Description:Q06418
Residue:890
BDBM50425842
NameBDBM50425842
Synonyms:CHEMBL2312292
TypeSmall organic molecule
Emp. Form.C26H36N6O4
Mol. Mass.496.6018
SMILESCOc1cc(CCNc2ncc(C(=O)NCCCN3CCCC3=O)c(NC3CCCC3)n2)ccc1O