Reaction Details
TargetTyrosine-protein kinase receptor TYRO3
LigandBDBM50425848
Substrate/Competitorn/a
Meas. Tech.ChEMBL_933487 (CHEMBL2319403)
IC50 180±n/a nM
Citation Powell, NAHoffman, JKCiske, FLKaufman, MDKohrt, JTQuin, JSheehan, DJDelaney, ABaxi, SMCatana, CMcConnell, POhren, JPerrin, LAEdmunds, JJ Highly selective 2,4-diaminopyrimidine-5-carboxamide inhibitors of Sky kinase. Bioorg Med Chem Lett23:1046-50 (2013) 
 
Tyrosine-protein kinase receptor TYRO3
Name:Tyrosine-protein kinase receptor TYRO3
Type:Protein
Mol. Mass.:96894.13
Organism:Homo sapiens (Human)
Description:Q06418
Residue:890
BDBM50425848
NameBDBM50425848
Synonyms:CHEMBL2312314
TypeSmall organic molecule
Emp. Form.C25H33ClN6O2
Mol. Mass.485.022
SMILESClc1ccccc1CCNc1ncc(C(=O)NCCCN2CCCC2=O)c(NC2CCCC2)n1