Reaction Details
TargetTyrosine-protein kinase receptor TYRO3
LigandBDBM50425853
Substrate/Competitorn/a
Meas. Tech.ChEMBL_933487 (CHEMBL2319403)
IC50 810±n/a nM
Citation Powell, NAHoffman, JKCiske, FLKaufman, MDKohrt, JTQuin, JSheehan, DJDelaney, ABaxi, SMCatana, CMcConnell, POhren, JPerrin, LAEdmunds, JJ Highly selective 2,4-diaminopyrimidine-5-carboxamide inhibitors of Sky kinase. Bioorg Med Chem Lett23:1046-50 (2013) 
 
Tyrosine-protein kinase receptor TYRO3
Name:Tyrosine-protein kinase receptor TYRO3
Type:Protein
Mol. Mass.:96894.13
Organism:Homo sapiens (Human)
Description:Q06418
Residue:890
BDBM50425853
NameBDBM50425853
Synonyms:CHEMBL2312309
TypeSmall organic molecule
Emp. Form.C25H34N6O2
Mol. Mass.450.5765
SMILESO=C(NCCCN1CCCC1=O)c1cnc(NCCc2ccccc2)nc1NC1CCCC1