Reaction Details
TargetMyosin light chain kinase 2, skeletal/cardiac muscle
LigandBDBM50425862
Substrate/Competitorn/a
Meas. Tech.ChEMBL_933533 (CHEMBL2319695)
IC50 4860±n/a nM
Citation Powell, NAHoffman, JKCiske, FLKohrt, JTBaxi, SMPeng, YWZhong, MCatana, COhren, JPerrin, LAEdmunds, JJ Optimization of highly selective 2,4-diaminopyrimidine-5-carboxamide inhibitors of Sky kinase. Bioorg Med Chem Lett23:1051-5 (2013) 
 
Myosin light chain kinase 2, skeletal/cardiac muscle
Name:Myosin light chain kinase 2, skeletal/cardiac muscle
Type:PROTEIN
Mol. Mass.:64687.13
Organism:Homo sapiens (Human)
Description:ChEMBL_586581
Residue:596
BDBM50425862
NameBDBM50425862
Synonyms:CHEMBL2312654
TypeSmall organic molecule
Emp. Form.C22H26Cl2N6O
Mol. Mass.461.387
SMILESCN(C)C1CCC(CC1)Nc1nc(Nc2cc(Cl)cc(Cl)c2)ncc1-c1cc(C)no1