Reaction Details
TargetMitogen-activated protein kinase kinase kinase 9
LigandBDBM50425864
Substrate/Competitorn/a
Meas. Tech.ChEMBL_933539 (CHEMBL2319701)
IC50 12230±n/a nM
Citation Powell, NAHoffman, JKCiske, FLKohrt, JTBaxi, SMPeng, YWZhong, MCatana, COhren, JPerrin, LAEdmunds, JJ Optimization of highly selective 2,4-diaminopyrimidine-5-carboxamide inhibitors of Sky kinase. Bioorg Med Chem Lett23:1051-5 (2013) 
 
Mitogen-activated protein kinase kinase kinase 9
Name:Mitogen-activated protein kinase kinase kinase 9
Type:protein
Mol. Mass.:121881.51
Organism:Homo sapiens (Human)
Description:P80192
Residue:1104
BDBM50425864
NameBDBM50425864
Synonyms:CHEMBL2312649
TypeSmall organic molecule
Emp. Form.C25H35Cl2N7O
Mol. Mass.520.498
SMILESCN(C)C1CCC(CC1)Nc1nc(Nc2cc(Cl)cc(Cl)c2)ncc1C(=O)NC1CCN(C)CC1