Reaction Details
TargetTyrosine-protein kinase Lck
LigandBDBM50425865
Substrate/Competitorn/a
Meas. Tech.ChEMBL_933950 (CHEMBL2317768)
IC50 1360±n/a nM
Citation Powell, NAHoffman, JKCiske, FLKohrt, JTBaxi, SMPeng, YWZhong, MCatana, COhren, JPerrin, LAEdmunds, JJ Optimization of highly selective 2,4-diaminopyrimidine-5-carboxamide inhibitors of Sky kinase. Bioorg Med Chem Lett23:1051-5 (2013) 
 
Tyrosine-protein kinase Lck
Name:Tyrosine-protein kinase Lck
Type:n/a
Mol. Mass.:57987.83
Organism:Homo sapiens (Human)
Description:P06239
Residue:509
BDBM50425865
NameBDBM50425865
Synonyms:CHEMBL2312646
TypeSmall organic molecule
Emp. Form.C23H30Cl2N6O
Mol. Mass.477.43
SMILESCN1CCC(CC1)NC(=O)c1cnc(NCc2cc(Cl)ccc2Cl)nc1NC1CCCC1