Reaction Details
TargetTyrosine-protein kinase JAK3
LigandBDBM50425863
Substrate/Competitorn/a
Meas. Tech.ChEMBL_933952 (CHEMBL2317770)
IC50 30000±n/a nM
Citation Powell, NAHoffman, JKCiske, FLKohrt, JTBaxi, SMPeng, YWZhong, MCatana, COhren, JPerrin, LAEdmunds, JJ Optimization of highly selective 2,4-diaminopyrimidine-5-carboxamide inhibitors of Sky kinase. Bioorg Med Chem Lett23:1051-5 (2013) 
 
Tyrosine-protein kinase JAK3
Name:Tyrosine-protein kinase JAK3
Type:Protein
Mol. Mass.:125111.08
Organism:Homo sapiens (Human)
Description:P52333
Residue:1124
BDBM50425863
NameBDBM50425863
Synonyms:CHEMBL2312652
TypeSmall organic molecule
Emp. Form.C21H26Cl2N6O3
Mol. Mass.481.376
SMILESCN1CCC(CC1)NC(=O)c1cnc(Nc2cc(Cl)cc(Cl)c2)nc1N[C@@H]1COC[C@H]1O