Reaction Details
TargetTyrosine-protein kinase BTK
LigandBDBM50425865
Substrate/Competitorn/a
Meas. Tech.ChEMBL_933968 (CHEMBL2317786)
IC50 25670±n/a nM
Citation Powell, NAHoffman, JKCiske, FLKohrt, JTBaxi, SMPeng, YWZhong, MCatana, COhren, JPerrin, LAEdmunds, JJ Optimization of highly selective 2,4-diaminopyrimidine-5-carboxamide inhibitors of Sky kinase. Bioorg Med Chem Lett23:1051-5 (2013) 
 
Tyrosine-protein kinase BTK
Name:Tyrosine-protein kinase BTK
Type:Enzyme
Mol. Mass.:76289.95
Organism:Homo sapiens (Human)
Description:Q06187
Residue:659
BDBM50425865
NameBDBM50425865
Synonyms:CHEMBL2312646
TypeSmall organic molecule
Emp. Form.C23H30Cl2N6O
Mol. Mass.477.43
SMILESCN1CCC(CC1)NC(=O)c1cnc(NCc2cc(Cl)ccc2Cl)nc1NC1CCCC1