Reaction Details
TargetAurora kinase A
LigandBDBM50425861
Substrate/Competitorn/a
Meas. Tech.ChEMBL_933967 (CHEMBL2317785)
IC50 30000±n/a nM
Citation Powell, NAHoffman, JKCiske, FLKohrt, JTBaxi, SMPeng, YWZhong, MCatana, COhren, JPerrin, LAEdmunds, JJ Optimization of highly selective 2,4-diaminopyrimidine-5-carboxamide inhibitors of Sky kinase. Bioorg Med Chem Lett23:1051-5 (2013) 
 
Aurora kinase A
Name:Aurora kinase A
Type:Serine/threonine-protein kinase
Mol. Mass.:45830.98
Organism:Homo sapiens (Human)
Description:O14965
Residue:403
BDBM50425861
NameBDBM50425861
Synonyms:CHEMBL2312645
TypeSmall organic molecule
Emp. Form.C24H34N6O2
Mol. Mass.438.5658
SMILESCOc1ccccc1CNc1ncc(C(=O)NC2CCN(C)CC2)c(NC2CCCC2)n1