Reaction Details
TargetSerine/threonine-protein kinase PAK 4
LigandBDBM50425865
Substrate/Competitorn/a
Meas. Tech.ChEMBL_933530 (CHEMBL2319446)
IC50 30000±n/a nM
Citation Powell, NAHoffman, JKCiske, FLKohrt, JTBaxi, SMPeng, YWZhong, MCatana, COhren, JPerrin, LAEdmunds, JJ Optimization of highly selective 2,4-diaminopyrimidine-5-carboxamide inhibitors of Sky kinase. Bioorg Med Chem Lett23:1051-5 (2013) 
 
Serine/threonine-protein kinase PAK 4
Name:Serine/threonine-protein kinase PAK 4
Type:Protein
Mol. Mass.:64098.01
Organism:Homo sapiens (Human)
Description:O96013
Residue:591
BDBM50425865
NameBDBM50425865
Synonyms:CHEMBL2312646
TypeSmall organic molecule
Emp. Form.C23H30Cl2N6O
Mol. Mass.477.43
SMILESCN1CCC(CC1)NC(=O)c1cnc(NCc2cc(Cl)ccc2Cl)nc1NC1CCCC1