Reaction Details
TargetThreonine--tRNA ligase 1, cytoplasmic
LigandBDBM50426192
Substrate/Competitorn/a
Meas. Tech.ChEMBL_935846 (CHEMBL2317882)
Ki>50000±n/a nM
Citation Teng, MHilgers, MTCunningham, MLBorchardt, ALocke, JBAbraham, SHaley, GKwan, BPHall, CHough, GWShaw, KJFinn, J Identification of bacteria-selective threonyl-tRNA synthetase substrate inhibitors by structure-based design. J Med Chem56:1748-60 (2013) 
 
Threonine--tRNA ligase 1, cytoplasmic
Name:Threonine--tRNA ligase 1, cytoplasmic
Type:PROTEIN
Mol. Mass.:83435.65
Organism:Homo sapiens (Human)
Description:ChEMBL_935846
Residue:723
BDBM50426192
NameBDBM50426192
Synonyms:CHEMBL2316968
TypeSmall organic molecule
Emp. Form.C16H18N4O5S
Mol. Mass.378.403
SMILESC[C@@H](O)[C@H](O)C(=O)NS(=O)(=O)\C=C\c1cccc(c1)-c1cc(N)ncn1