Reaction Details
TargetThreonine--tRNA ligase
LigandBDBM50426178
Substrate/Competitorn/a
Meas. Tech.ChEMBL_935847 (CHEMBL2317883)
Ki 83±n/a nM
Citation Teng, MHilgers, MTCunningham, MLBorchardt, ALocke, JBAbraham, SHaley, GKwan, BPHall, CHough, GWShaw, KJFinn, J Identification of bacteria-selective threonyl-tRNA synthetase substrate inhibitors by structure-based design. J Med Chem56:1748-60 (2013) 
 
Threonine--tRNA ligase
Name:Threonine--tRNA ligase
Type:PROTEIN
Mol. Mass.:73649.43
Organism:Yersinia pestis
Description:ChEMBL_935847
Residue:642
BDBM50426178
NameBDBM50426178
Synonyms:CHEMBL2316960
TypeSmall organic molecule
Emp. Form.C18H20N4O4S
Mol. Mass.388.441
SMILESC[C@@H](O)[C@H](N)C(=O)NS(=O)(=O)c1cccc(c1)-c1ccc2[nH]nc(C)c2c1